Welcome!

Welcome to the official BlackBerry Support Community Forums.

This is your resource to discuss support topics with your peers, and learn from each other.

inside custom component

Native Development

Reply
Contributor
strgezer
Posts: 11
Registered: ‎12-20-2012
My Device: blackberry playbook
My Carrier: none
Accepted Solution

make error -- how to debug??

i'm new at blackberry development.   i'm working on an app for BB10.  my host machine is win7 64bit.   i'm getting this error when i try to compile my app:

 

make: ***[Device-Debug] Error 2

 

not the most descriptive error report i've ever seen.   can anyone point me in the right direction to figure out what i've done wrong?

Please use plain text.
Developer
BGmot
Posts: 1,068
Registered: ‎11-24-2011
My Device: PlayBook
My Carrier: x

Re: make error -- how to debug??

Can you post full console output?

Please use plain text.
Contributor
strgezer
Posts: 11
Registered: ‎12-20-2012
My Device: blackberry playbook
My Carrier: none

Re: make error -- how to debug??

here's the build log:

 


**** Build of configuration Device-Debug for project firstMag ****

make Device-Debug
make -C .//translations -f Makefile update
make[1]: Entering directory `C:/Users/mark/Documents/ndk-10.0.9-workspace/firstMag/translations'
C:/bbndk/host_10_0_9_404/win32/x86/usr/bin/lupdate firstMag.pro
cd arm && C:/bbndk/host_10_0_9_404/win32/x86/usr/bin/qmake -spec blackberry-armv7le-qcc ../firstMag.pro CONFIG+=debug_and_release CONFIG+=device
Updating 'firstMag.ts'...
    Found 1 source text(s) (0 new and 1 already existing)
make[1]: Leaving directory `C:/Users/mark/Documents/ndk-10.0.9-workspace/firstMag/translations'
make -C .//translations -f Makefile release
make[1]: Entering directory `C:/Users/mark/Documents/ndk-10.0.9-workspace/firstMag/translations'
C:/bbndk/host_10_0_9_404/win32/x86/usr/bin/lrelease firstMag.pro
The directory name is invalid.
Updating 'C:/Users/mark/Documents/ndk-10.0.9-workspace/firstMag/translations/firstMag.qm'...
    Generated 0 translation(s) (0 finished and 0 unfinished)
    Ignored 1 untranslated source text(s)
make[1]: Leaving directory `C:/Users/mark/Documents/ndk-10.0.9-workspace/firstMag/translations'
make -C ./arm -f Makefile debug
make[1]: Entering directory `C:/Users/mark/Documents/ndk-10.0.9-workspace/firstMag/arm'
make -f Makefile.Debug
make[2]: Entering directory `C:/Users/mark/Documents/ndk-10.0.9-workspace/firstMag/arm'
qcc -Vgcc_ntoarmv7le -Wno-psabi -lang-c++ -fstack-protector-strong -mcpu=cortex-a9 -g -Wno-psabi -Wall -W -D_REENTRANT -DQT_NO_IMPORT_QT47_QML -DQ_OS_BLACKBERRY -DQT_DECLARATIVE_DEBUG -DQT_DECLARATIVE_LIB -DQT_CORE_LIB -DQT_SHARED -Ic:/bbndk/target_10_0_9_1673/qnx6/usr/share/qt4/mkspecs/blackberry-armv7le-qcc -I../../firstMag -Ic:/bbndk/target_10_0_9_1673/qnx6/usr/include/qt4/QtCore -Ic:/bbndk/target_10_0_9_1673/qnx6/usr/include/qt4/QtDeclarative -Ic:/bbndk/target_10_0_9_1673/qnx6/usr/include/qt4 -I../src -Io.le-v7-g/.moc -Ic:/bbndk/target_10_0_9_1673/qnx6/usr/include -Ic:/bbndk/target_10_0_9_1673/qnx6/usr/include/freetype2 -I. -x c++-header -c ../precompiled.h -o o.le-v7-g/.obj/firstMag.gch/c++
qcc -Vgcc_ntoarmv7le -c -Wc,-include -Wc,o.le-v7-g/.obj/firstMag -Wno-psabi -lang-c++ -fstack-protector-strong -mcpu=cortex-a9 -g -Wno-psabi -Wall -W -D_REENTRANT -DQT_NO_IMPORT_QT47_QML -DQ_OS_BLACKBERRY -DQT_DECLARATIVE_DEBUG -DQT_DECLARATIVE_LIB -DQT_CORE_LIB -DQT_SHARED -Ic:/bbndk/target_10_0_9_1673/qnx6/usr/share/qt4/mkspecs/blackberry-armv7le-qcc -I../../firstMag -Ic:/bbndk/target_10_0_9_1673/qnx6/usr/include/qt4/QtCore -Ic:/bbndk/target_10_0_9_1673/qnx6/usr/include/qt4/QtDeclarative -Ic:/bbndk/target_10_0_9_1673/qnx6/usr/include/qt4 -I../src -Io.le-v7-g/.moc -Ic:/bbndk/target_10_0_9_1673/qnx6/usr/include -Ic:/bbndk/target_10_0_9_1673/qnx6/usr/include/freetype2 -I. -o o.le-v7-g/.obj/FirstMag.o ../src/FirstMag.cpp
qcc -Vgcc_ntoarmv7le -c -Wc,-include -Wc,o.le-v7-g/.obj/firstMag -Wno-psabi -lang-c++ -fstack-protector-strong -mcpu=cortex-a9 -g -Wno-psabi -Wall -W -D_REENTRANT -DQT_NO_IMPORT_QT47_QML -DQ_OS_BLACKBERRY -DQT_DECLARATIVE_DEBUG -DQT_DECLARATIVE_LIB -DQT_CORE_LIB -DQT_SHARED -Ic:/bbndk/target_10_0_9_1673/qnx6/usr/share/qt4/mkspecs/blackberry-armv7le-qcc -I../../firstMag -Ic:/bbndk/target_10_0_9_1673/qnx6/usr/include/qt4/QtCore -Ic:/bbndk/target_10_0_9_1673/qnx6/usr/include/qt4/QtDeclarative -Ic:/bbndk/target_10_0_9_1673/qnx6/usr/include/qt4 -I../src -Io.le-v7-g/.moc -Ic:/bbndk/target_10_0_9_1673/qnx6/usr/include -Ic:/bbndk/target_10_0_9_1673/qnx6/usr/include/freetype2 -I. -o o.le-v7-g/.obj/main.o ../src/main.cpp
C:/bbndk/host_10_0_9_404/win32/x86/usr/bin/moc.exe -DQT_NO_IMPORT_QT47_QML -DQ_OS_BLACKBERRY -DQT_DECLARATIVE_DEBUG -DQT_DECLARATIVE_LIB -DQT_CORE_LIB -DQT_SHARED -Ic:/bbndk/target_10_0_9_1673/qnx6/usr/share/qt4/mkspecs/blackberry-armv7le-qcc -I../../firstMag -Ic:/bbndk/target_10_0_9_1673/qnx6/usr/include/qt4/QtCore -Ic:/bbndk/target_10_0_9_1673/qnx6/usr/include/qt4/QtDeclarative -Ic:/bbndk/target_10_0_9_1673/qnx6/usr/include/qt4 -I../src -Io.le-v7-g/.moc -Ic:/bbndk/target_10_0_9_1673/qnx6/usr/include -Ic:/bbndk/target_10_0_9_1673/qnx6/usr/include/freetype2 -I. -D__QNXNTO__ ../src/FirstMag.hpp -o o.le-v7-g/.moc/moc_FirstMag.cpp
qcc -Vgcc_ntoarmv7le -c -Wc,-include -Wc,o.le-v7-g/.obj/firstMag -Wno-psabi -lang-c++ -fstack-protector-strong -mcpu=cortex-a9 -g -Wno-psabi -Wall -W -D_REENTRANT -DQT_NO_IMPORT_QT47_QML -DQ_OS_BLACKBERRY -DQT_DECLARATIVE_DEBUG -DQT_DECLARATIVE_LIB -DQT_CORE_LIB -DQT_SHARED -Ic:/bbndk/target_10_0_9_1673/qnx6/usr/share/qt4/mkspecs/blackberry-armv7le-qcc -I../../firstMag -Ic:/bbndk/target_10_0_9_1673/qnx6/usr/include/qt4/QtCore -Ic:/bbndk/target_10_0_9_1673/qnx6/usr/include/qt4/QtDeclarative -Ic:/bbndk/target_10_0_9_1673/qnx6/usr/include/qt4 -I../src -Io.le-v7-g/.moc -Ic:/bbndk/target_10_0_9_1673/qnx6/usr/include -Ic:/bbndk/target_10_0_9_1673/qnx6/usr/include/freetype2 -I. -o o.le-v7-g/.obj/moc_FirstMag.o o.le-v7-g/.moc/moc_FirstMag.cpp
qcc -Vgcc_ntoarmv7le -lang-c++ -Wl,-rpath-link,C:/bbndk/target_10_0_9_1673/qnx6/armle-v7/lib -Wl,-rpath-link,C:/bbndk/target_10_0_9_1673/qnx6/armle-v7/usr/lib -Wl,-rpath-link,C:/bbndk/target_10_0_9_1673/qnx6/armle-v7/usr/lib/qt4/lib -o o.le-v7-g/firstMag o.le-v7-g/.obj/FirstMag.o o.le-v7-g/.obj/main.o o.le-v7-g/.obj/moc_FirstMag.o    -LC:/bbndk/target_10_0_9_1673/qnx6/armle-v7/lib -LC:/bbndk/target_10_0_9_1673/qnx6/armle-v7/usr/lib -LC:/bbndk/target_10_0_9_1673/qnx6/armle-v7/usr/lib/qt4/lib -LC:/bbndk/target_10_0_9_1673/qnx6//usr/lib/qt4/lib -lbbcascades -lQtDeclarative -lQtScript -lQtSvg -lQtSql -lsqlite3 -lz -lQtXmlPatterns -lQtGui -lQtNetwork -lsocket -lQtCore -lm -lbps
make[2]: Leaving directory `C:/Users/mark/Documents/ndk-10.0.9-workspace/firstMag/arm'
make[1]: Leaving directory `C:/Users/mark/Documents/ndk-10.0.9-workspace/firstMag/arm'
Could not find qmake configuration directoryCould not find qmake configuration fileUsing OS scope before setting MAKEFILE_GENERATORC:\bbndk\host_10_0_9_404\win32\x86\usr\bin\ntoarm-ld: o.le-v7-g/.obj/FirstMag.o: undefined reference to symbol 'screen_set_window_property_iv'
C:\bbndk\host_10_0_9_404\win32\x86\usr\bin\ntoarm-ld: note: 'screen_set_window_property_iv' is defined in DSO C:/bbndk/target_10_0_9_1673/qnx6/armle-v7/usr/lib/libscreen.so.1 so try adding it to the linker command line
C:/bbndk/target_10_0_9_1673/qnx6/armle-v7/usr/lib/libscreen.so.1: could not read symbols: Invalid operation
cc: C:/bbndk/host_10_0_9_404/win32/x86/usr/bin/ntoarm-ld caught signal 1
make[2]: *** [o.le-v7-g/firstMag] Error 1
make[1]: *** [debug] Error 2
make: *** [Device-Debug] Error 2

**** Build Finished ****

Please use plain text.
Developer
Zmey
Posts: 1,512
Registered: ‎12-18-2012
My Device: PlayBook, Z10, DAC

Re: make error -- how to debug??

C:/bbndk/target_10_0_9_1673/qnx6/armle-v7/usr/lib/libscreen.so.1 so try adding it to the linker command line

 

This error message tells to add "-lscreen" to LIBS in .pro file. "lib" is prepended automatically.

 


Andrey Fidrya, @zmeyc on twitter
Please use plain text.
Contributor
strgezer
Posts: 11
Registered: ‎12-20-2012
My Device: blackberry playbook
My Carrier: none

Re: make error -- how to debug??

that fixed it, thanks!!   a noobie mistake.

Please use plain text.
Regular Contributor
ashish_developer
Posts: 96
Registered: ‎05-15-2013
My Device: blackberry z10
My Carrier: blackberry

Re: make error -- how to debug??

Hi,

i have the same problem..here is my console output

 

 

**** Build of configuration Simulator-Debug for project fiume ****

make Simulator-Debug
make -C .//translations -f Makefile update
make[1]: Entering directory `D:/Downloads/kuzarandasource/kuzaranda-src-01102013/translations'
C:/bbndk/host_10_1_0_132/win32/x86/usr/bin/lupdate fiume.pro
Updating 'fiume.ts'...
Found 35 source text(s) (0 new and 35 already existing)
make[1]: Leaving directory `D:/Downloads/kuzarandasource/kuzaranda-src-01102013/translations'
make -C .//translations -f Makefile release
cd x86 && C:/bbndk/host_10_1_0_132/win32/x86/usr/bin/qmake -spec blackberry-x86-qcc ../fiume.pro CONFIG+=debug_and_release CONFIG+=simulator
make[1]: Entering directory `D:/Downloads/kuzarandasource/kuzaranda-src-01102013/translations'
C:/bbndk/host_10_1_0_132/win32/x86/usr/bin/lrelease fiume.pro
Updating 'D:/Downloads/kuzarandasource/kuzaranda-src-01102013/translations/fiume.qm'...
Generated 0 translation(s) (0 finished and 0 unfinished)
Ignored 35 untranslated source text(s)
make[1]: Leaving directory `D:/Downloads/kuzarandasource/kuzaranda-src-01102013/translations'
make -C ./x86 -f Makefile debug
make[1]: Entering directory `D:/Downloads/kuzarandasource/kuzaranda-src-01102013/x86'
make -f Makefile.Debug
make[2]: Entering directory `D:/Downloads/kuzarandasource/kuzaranda-src-01102013/x86'
qcc -Vgcc_ntox86 -lang-c++ -Wl,-rpath-link,C:/bbndk/target_10_1_0_1020/qnx6/x86/lib -Wl,-rpath-link,C:/bbndk/target_10_1_0_1020/qnx6/x86/usr/lib -Wl,-rpath-link,C:/bbndk/target_10_1_0_1020/qnx6/x86/usr/lib/qt4/lib -o o-g/fiume o-g/.obj/AddressBook.o o-g/.obj/AudioManager.o o-g/.obj/BpsPlatform.o o-g/.obj/ContactEditor.o o-g/.obj/ContactViewer.o o-g/.obj/Fiume.o o-g/.obj/PjCallback.o o-g/.obj/buddy.o o-g/.obj/callhistory.o o-g/.obj/callhistoryrecord.o o-g/.obj/debugger.o o-g/.obj/kuzaranda.o o-g/.obj/main.o o-g/.obj/navigator.o o-g/.obj/moc_AddressBook.o o-g/.obj/moc_AudioManager.o o-g/.obj/moc_BpsPlatform.o o-g/.obj/moc_ContactEditor.o o-g/.obj/moc_ContactViewer.o o-g/.obj/moc_Fiume.o o-g/.obj/moc_PjCallback.o o-g/.obj/moc_buddy.o o-g/.obj/moc_callhistory.o o-g/.obj/moc_callhistoryrecord.o o-g/.obj/moc_debugger.o o-g/.obj/moc_kuzaranda.o o-g/.obj/moc_navigator.o -LC:/bbndk/target_10_1_0_1020/qnx6/x86/lib -LC:/bbndk/target_10_1_0_1020/qnx6/x86/usr/lib -LC:/bbndk/target_10_1_0_1020/qnx6/x86/usr/lib/qt4/lib -LC:/bbndk/target_10_1_0_1020/qnx6//usr/lib/qt4/lib -L../lib -L../lib/upnp -lpjsua-arm-unknown-nto-qnx8.0.0eabi -lpjsip-ua-arm-unknown-nto-qnx8.0.0eabi -lpjsip-simple-arm-unknown-nto-qnx8.0.0eabi -lpjsip-arm-unknown-nto-qnx8.0.0eabi -lpjmedia-codec-arm-unknown-nto-qnx8.0.0eabi -lpjmedia-videodev-arm-unknown-nto-qnx8.0.0eabi -lpjmedia-arm-unknown-nto-qnx8.0.0eabi -lpjmedia-audiodev-arm-unknown-nto-qnx8.0.0eabi -lpjnath-arm-unknown-nto-qnx8.0.0eabi -lpjlib-util-arm-unknown-nto-qnx8.0.0eabi -lresample-arm-unknown-nto-qnx8.0.0eabi -lmilenage-arm-unknown-nto-qnx8.0.0eabi -lsrtp-arm-unknown-nto-qnx8.0.0eabi -lgsmcodec-arm-unknown-nto-qnx8.0.0eabi -lspeex-arm-unknown-nto-qnx8.0.0eabi -lilbccodec-arm-unknown-nto-qnx8.0.0eabi -lg7221codec-arm-unknown-nto-qnx8.0.0eabi -lportaudio-arm-unknown-nto-qnx8.0.0eabi -lpj-arm-unknown-nto-qnx8.0.0eabi -lasound -lcrypto -lssl -lbbpim -laudio_manager -lbb -lbbsystem -lbbplatform -lscreen -lminiupnpc -LC:/bbndk/target_10_1_0_1020/qnx6/usr/share/qt4/lib -lQtSensors -lbbcascades -lQtDeclarative -lQtScript -lQtSvg -lQtSql -lsqlite3 -lz -lQtXmlPatterns -lQtGui -lQtNetwork -lsocket -lQtCore -lm -lbps
Could not find qmake configuration fileUsing OS scope before setting MAKEFILE_GENERATORC:/bbndk/target_10_1_0_1020/qnx6/usr/share/qt4/mkspecs/features/mobility.prf(29): Using OS scope before setting MAKEFILE_GENERATORC:/bbndk/target_10_1_0_1020/qnx6/usr/share/qt4/mkspecs/features/mobility.prf(41): Using OS scope before setting MAKEFILE_GENERATORC:/bbndk/target_10_1_0_1020/qnx6/usr/share/qt4/mkspecs/features/mobility.prf(23): 'qtAddLibrary' is not a recognized test functionC:/bbndk/target_10_1_0_1020/qnx6/usr/share/qt4/mkspecs/features/mobility.prf(133): Using OS scope before setting MAKEFILE_GENERATORC:/bbndk/target_10_1_0_1020/qnx6/usr/share/qt4/mkspecs/features/qt.prf(4): Using OS scope before setting MAKEFILE_GENERATORC:/bbndk/target_10_1_0_1020/qnx6/usr/share/qt4/mkspecs/features/qt.prf(36): Using OS scope before setting MAKEFILE_GENERATORC:/bbndk/target_10_1_0_1020/qnx6/usr/share/qt4/mkspecs/features/qt.prf(197): 'qtAddLibrary' is not a recognized test functionC:/bbndk/target_10_1_0_1020/qnx6/usr/share/qt4/mkspecs/features/qt.prf(213): Using OS scope before setting MAKEFILE_GENERATORC:/bbndk/target_10_1_0_1020/qnx6/usr/share/qt4/mkspecs/features/moc.prf(3): 'qtPrepareTool' is not a recognized test functionC:/bbndk/target_10_1_0_1020/qnx6/usr/share/qt4/mkspecs/features/moc.prf(12): Using OS scope before setting MAKEFILE_GENERATORC:/bbndk/target_10_1_0_1020/qnx6/usr/share/qt4/mkspecs/features/moc.prf(97): Using OS scope before setting MAKEFILE_GENERATORC:/bbndk/target_10_1_0_1020/qnx6/usr/share/qt4/mkspecs/features/uic.prf(108): Using OS scope before setting MAKEFILE_GENERATORCould not find qmake configuration fileUsing OS scope before setting MAKEFILE_GENERATORC:/bbndk/target_10_1_0_1020/qnx6/usr/share/qt4/mkspecs/features/mobility.prf(29): Using OS scope before setting MAKEFILE_GENERATORC:/bbndk/target_10_1_0_1020/qnx6/usr/share/qt4/mkspecs/features/mobility.prf(41): Using OS scope before setting MAKEFILE_GENERATORC:/bbndk/target_10_1_0_1020/qnx6/usr/share/qt4/mkspecs/features/mobility.prf(23): 'qtAddLibrary' is not a recognized test functionC:/bbndk/target_10_1_0_1020/qnx6/usr/share/qt4/mkspecs/features/mobility.prf(133): Using OS scope before setting MAKEFILE_GENERATORC:/bbndk/target_10_1_0_1020/qnx6/usr/share/qt4/mkspecs/features/qt.prf(4): Using OS scope before setting MAKEFILE_GENERATORC:/bbndk/target_10_1_0_1020/qnx6/usr/share/qt4/mkspecs/features/qt.prf(36): Using OS scope before setting MAKEFILE_GENERATORC:/bbndk/target_10_1_0_1020/qnx6/usr/share/qt4/mkspecs/features/qt.prf(197): 'qtAddLibrary' is not a recognized test functionC:/bbndk/target_10_1_0_1020/qnx6/usr/share/qt4/mkspecs/features/qt.prf(213): Using OS scope before setting MAKEFILE_GENERATORC:/bbndk/target_10_1_0_1020/qnx6/usr/share/qt4/mkspecs/features/moc.prf(3): 'qtPrepareTool' is not a recognized test functionC:/bbndk/target_10_1_0_1020/qnx6/usr/share/qt4/mkspecs/features/moc.prf(12): Using OS scope before setting MAKEFILE_GENERATORC:/bbndk/target_10_1_0_1020/qnx6/usr/share/qt4/mkspecs/features/moc.prf(97): Using OS scope before setting MAKEFILE_GENERATORC:/bbndk/target_10_1_0_1020/qnx6/usr/share/qt4/mkspecs/features/uic.prf(108): Using OS scope before setting MAKEFILE_GENERATORC:\bbndk\host_10_1_0_132\win32\x86\usr\bin\ntox86-ld: skipping incompatible ../lib\libpjsua-arm-unknown-nto-qnx8.0.0eabi.a when searching for -lpjsua-arm-unknown-nto-qnx8.0.0eabi
C:\bbndk\host_10_1_0_132\win32\x86\usr\bin\ntox86-ld: skipping incompatible ../lib/upnp\libpjsua-arm-unknown-nto-qnx8.0.0eabi.a when searching for -lpjsua-arm-unknown-nto-qnx8.0.0eabi
C:\bbndk\host_10_1_0_132\win32\x86\usr\bin\ntox86-ld: cannot find -lpjsua-arm-unknown-nto-qnx8.0.0eabi
C:\bbndk\host_10_1_0_132\win32\x86\usr\bin\ntox86-ld: skipping incompatible ../lib\libpjsip-ua-arm-unknown-nto-qnx8.0.0eabi.a when searching for -lpjsip-ua-arm-unknown-nto-qnx8.0.0eabi
C:\bbndk\host_10_1_0_132\win32\x86\usr\bin\ntox86-ld: skipping incompatible ../lib/upnp\libpjsip-ua-arm-unknown-nto-qnx8.0.0eabi.a when searching for -lpjsip-ua-arm-unknown-nto-qnx8.0.0eabi
C:\bbndk\host_10_1_0_132\win32\x86\usr\bin\ntox86-ld: cannot find -lpjsip-ua-arm-unknown-nto-qnx8.0.0eabi
C:\bbndk\host_10_1_0_132\win32\x86\usr\bin\ntox86-ld: skipping incompatible ../lib\libpjsip-simple-arm-unknown-nto-qnx8.0.0eabi.a when searching for -lpjsip-simple-arm-unknown-nto-qnx8.0.0eabi
C:\bbndk\host_10_1_0_132\win32\x86\usr\bin\ntox86-ld: skipping incompatible ../lib/upnp\libpjsip-simple-arm-unknown-nto-qnx8.0.0eabi.a when searching for -lpjsip-simple-arm-unknown-nto-qnx8.0.0eabi
C:\bbndk\host_10_1_0_132\win32\x86\usr\bin\ntox86-ld: cannot find -lpjsip-simple-arm-unknown-nto-qnx8.0.0eabi
C:\bbndk\host_10_1_0_132\win32\x86\usr\bin\ntox86-ld: skipping incompatible ../lib\libpjsip-arm-unknown-nto-qnx8.0.0eabi.a when searching for -lpjsip-arm-unknown-nto-qnx8.0.0eabi
C:\bbndk\host_10_1_0_132\win32\x86\usr\bin\ntox86-ld: skipping incompatible ../lib/upnp\libpjsip-arm-unknown-nto-qnx8.0.0eabi.a when searching for -lpjsip-arm-unknown-nto-qnx8.0.0eabi
C:\bbndk\host_10_1_0_132\win32\x86\usr\bin\ntox86-ld: cannot find -lpjsip-arm-unknown-nto-qnx8.0.0eabi
C:\bbndk\host_10_1_0_132\win32\x86\usr\bin\ntox86-ld: skipping incompatible ../lib\libpjmedia-codec-arm-unknown-nto-qnx8.0.0eabi.a when searching for -lpjmedia-codec-arm-unknown-nto-qnx8.0.0eabi
C:\bbndk\host_10_1_0_132\win32\x86\usr\bin\ntox86-ld: skipping incompatible ../lib/upnp\libpjmedia-codec-arm-unknown-nto-qnx8.0.0eabi.a when searching for -lpjmedia-codec-arm-unknown-nto-qnx8.0.0eabi
C:\bbndk\host_10_1_0_132\win32\x86\usr\bin\ntox86-ld: cannot find -lpjmedia-codec-arm-unknown-nto-qnx8.0.0eabi
C:\bbndk\host_10_1_0_132\win32\x86\usr\bin\ntox86-ld: skipping incompatible ../lib\libpjmedia-videodev-arm-unknown-nto-qnx8.0.0eabi.a when searching for -lpjmedia-videodev-arm-unknown-nto-qnx8.0.0eabi
C:\bbndk\host_10_1_0_132\win32\x86\usr\bin\ntox86-ld: skipping incompatible ../lib/upnp\libpjmedia-videodev-arm-unknown-nto-qnx8.0.0eabi.a when searching for -lpjmedia-videodev-arm-unknown-nto-qnx8.0.0eabi
C:\bbndk\host_10_1_0_132\win32\x86\usr\bin\ntox86-ld: cannot find -lpjmedia-videodev-arm-unknown-nto-qnx8.0.0eabi
C:\bbndk\host_10_1_0_132\win32\x86\usr\bin\ntox86-ld: skipping incompatible ../lib\libpjmedia-arm-unknown-nto-qnx8.0.0eabi.a when searching for -lpjmedia-arm-unknown-nto-qnx8.0.0eabi
C:\bbndk\host_10_1_0_132\win32\x86\usr\bin\ntox86-ld: skipping incompatible ../lib/upnp\libpjmedia-arm-unknown-nto-qnx8.0.0eabi.a when searching for -lpjmedia-arm-unknown-nto-qnx8.0.0eabi
C:\bbndk\host_10_1_0_132\win32\x86\usr\bin\ntox86-ld: cannot find -lpjmedia-arm-unknown-nto-qnx8.0.0eabi
C:\bbndk\host_10_1_0_132\win32\x86\usr\bin\ntox86-ld: skipping incompatible ../lib\libpjmedia-audiodev-arm-unknown-nto-qnx8.0.0eabi.a when searching for -lpjmedia-audiodev-arm-unknown-nto-qnx8.0.0eabi
C:\bbndk\host_10_1_0_132\win32\x86\usr\bin\ntox86-ld: skipping incompatible ../lib/upnp\libpjmedia-audiodev-arm-unknown-nto-qnx8.0.0eabi.a when searching for -lpjmedia-audiodev-arm-unknown-nto-qnx8.0.0eabi
C:\bbndk\host_10_1_0_132\win32\x86\usr\bin\ntox86-ld: cannot find -lpjmedia-audiodev-arm-unknown-nto-qnx8.0.0eabi
C:\bbndk\host_10_1_0_132\win32\x86\usr\bin\ntox86-ld: skipping incompatible ../lib\libpjnath-arm-unknown-nto-qnx8.0.0eabi.a when searching for -lpjnath-arm-unknown-nto-qnx8.0.0eabi
C:\bbndk\host_10_1_0_132\win32\x86\usr\bin\ntox86-ld: skipping incompatible ../lib/upnp\libpjnath-arm-unknown-nto-qnx8.0.0eabi.a when searching for -lpjnath-arm-unknown-nto-qnx8.0.0eabi
C:\bbndk\host_10_1_0_132\win32\x86\usr\bin\ntox86-ld: cannot find -lpjnath-arm-unknown-nto-qnx8.0.0eabi
C:\bbndk\host_10_1_0_132\win32\x86\usr\bin\ntox86-ld: skipping incompatible ../lib\libpjlib-util-arm-unknown-nto-qnx8.0.0eabi.a when searching for -lpjlib-util-arm-unknown-nto-qnx8.0.0eabi
C:\bbndk\host_10_1_0_132\win32\x86\usr\bin\ntox86-ld: skipping incompatible ../lib/upnp\libpjlib-util-arm-unknown-nto-qnx8.0.0eabi.a when searching for -lpjlib-util-arm-unknown-nto-qnx8.0.0eabi
C:\bbndk\host_10_1_0_132\win32\x86\usr\bin\ntox86-ld: cannot find -lpjlib-util-arm-unknown-nto-qnx8.0.0eabi
C:\bbndk\host_10_1_0_132\win32\x86\usr\bin\ntox86-ld: skipping incompatible ../lib\libresample-arm-unknown-nto-qnx8.0.0eabi.a when searching for -lresample-arm-unknown-nto-qnx8.0.0eabi
C:\bbndk\host_10_1_0_132\win32\x86\usr\bin\ntox86-ld: skipping incompatible ../lib/upnp\libresample-arm-unknown-nto-qnx8.0.0eabi.a when searching for -lresample-arm-unknown-nto-qnx8.0.0eabi
C:\bbndk\host_10_1_0_132\win32\x86\usr\bin\ntox86-ld: cannot find -lresample-arm-unknown-nto-qnx8.0.0eabi
C:\bbndk\host_10_1_0_132\win32\x86\usr\bin\ntox86-ld: skipping incompatible ../lib\libmilenage-arm-unknown-nto-qnx8.0.0eabi.a when searching for -lmilenage-arm-unknown-nto-qnx8.0.0eabi
C:\bbndk\host_10_1_0_132\win32\x86\usr\bin\ntox86-ld: skipping incompatible ../lib/upnp\libmilenage-arm-unknown-nto-qnx8.0.0eabi.a when searching for -lmilenage-arm-unknown-nto-qnx8.0.0eabi
C:\bbndk\host_10_1_0_132\win32\x86\usr\bin\ntox86-ld: cannot find -lmilenage-arm-unknown-nto-qnx8.0.0eabi
C:\bbndk\host_10_1_0_132\win32\x86\usr\bin\ntox86-ld: skipping incompatible ../lib\libsrtp-arm-unknown-nto-qnx8.0.0eabi.a when searching for -lsrtp-arm-unknown-nto-qnx8.0.0eabi
C:\bbndk\host_10_1_0_132\win32\x86\usr\bin\ntox86-ld: skipping incompatible ../lib/upnp\libsrtp-arm-unknown-nto-qnx8.0.0eabi.a when searching for -lsrtp-arm-unknown-nto-qnx8.0.0eabi
C:\bbndk\host_10_1_0_132\win32\x86\usr\bin\ntox86-ld: cannot find -lsrtp-arm-unknown-nto-qnx8.0.0eabi
C:\bbndk\host_10_1_0_132\win32\x86\usr\bin\ntox86-ld: skipping incompatible ../lib\libgsmcodec-arm-unknown-nto-qnx8.0.0eabi.a when searching for -lgsmcodec-arm-unknown-nto-qnx8.0.0eabi
C:\bbndk\host_10_1_0_132\win32\x86\usr\bin\ntox86-ld: skipping incompatible ../lib/upnp\libgsmcodec-arm-unknown-nto-qnx8.0.0eabi.a when searching for -lgsmcodec-arm-unknown-nto-qnx8.0.0eabi
C:\bbndk\host_10_1_0_132\win32\x86\usr\bin\ntox86-ld: cannot find -lgsmcodec-arm-unknown-nto-qnx8.0.0eabi
C:\bbndk\host_10_1_0_132\win32\x86\usr\bin\ntox86-ld: skipping incompatible ../lib\libspeex-arm-unknown-nto-qnx8.0.0eabi.a when searching for -lspeex-arm-unknown-nto-qnx8.0.0eabi
C:\bbndk\host_10_1_0_132\win32\x86\usr\bin\ntox86-ld: skipping incompatible ../lib/upnp\libspeex-arm-unknown-nto-qnx8.0.0eabi.a when searching for -lspeex-arm-unknown-nto-qnx8.0.0eabi
C:\bbndk\host_10_1_0_132\win32\x86\usr\bin\ntox86-ld: cannot find -lspeex-arm-unknown-nto-qnx8.0.0eabi
C:\bbndk\host_10_1_0_132\win32\x86\usr\bin\ntox86-ld: skipping incompatible ../lib\libilbccodec-arm-unknown-nto-qnx8.0.0eabi.a when searching for -lilbccodec-arm-unknown-nto-qnx8.0.0eabi
C:\bbndk\host_10_1_0_132\win32\x86\usr\bin\ntox86-ld: skipping incompatible ../lib/upnp\libilbccodec-arm-unknown-nto-qnx8.0.0eabi.a when searching for -lilbccodec-arm-unknown-nto-qnx8.0.0eabi
C:\bbndk\host_10_1_0_132\win32\x86\usr\bin\ntox86-ld: cannot find -lilbccodec-arm-unknown-nto-qnx8.0.0eabi
C:\bbndk\host_10_1_0_132\win32\x86\usr\bin\ntox86-ld: skipping incompatible ../lib\libg7221codec-arm-unknown-nto-qnx8.0.0eabi.a when searching for -lg7221codec-arm-unknown-nto-qnx8.0.0eabi
C:\bbndk\host_10_1_0_132\win32\x86\usr\bin\ntox86-ld: skipping incompatible ../lib/upnp\libg7221codec-arm-unknown-nto-qnx8.0.0eabi.a when searching for -lg7221codec-arm-unknown-nto-qnx8.0.0eabi
C:\bbndk\host_10_1_0_132\win32\x86\usr\bin\ntox86-ld: cannot find -lg7221codec-arm-unknown-nto-qnx8.0.0eabi
C:\bbndk\host_10_1_0_132\win32\x86\usr\bin\ntox86-ld: skipping incompatible ../lib\libportaudio-arm-unknown-nto-qnx8.0.0eabi.a when searching for -lportaudio-arm-unknown-nto-qnx8.0.0eabi
C:\bbndk\host_10_1_0_132\win32\x86\usr\bin\ntox86-ld: skipping incompatible ../lib/upnp\libportaudio-arm-unknown-nto-qnx8.0.0eabi.a when searching for -lportaudio-arm-unknown-nto-qnx8.0.0eabi
C:\bbndk\host_10_1_0_132\win32\x86\usr\bin\ntox86-ld: cannot find -lportaudio-arm-unknown-nto-qnx8.0.0eabi
C:\bbndk\host_10_1_0_132\win32\x86\usr\bin\ntox86-ld: skipping incompatible ../lib\libpj-arm-unknown-nto-qnx8.0.0eabi.a when searching for -lpj-arm-unknown-nto-qnx8.0.0eabi
C:\bbndk\host_10_1_0_132\win32\x86\usr\bin\ntox86-ld: skipping incompatible ../lib/upnp\libpj-arm-unknown-nto-qnx8.0.0eabi.a when searching for -lpj-arm-unknown-nto-qnx8.0.0eabi
C:\bbndk\host_10_1_0_132\win32\x86\usr\bin\ntox86-ld: cannot find -lpj-arm-unknown-nto-qnx8.0.0eabi
C:\bbndk\host_10_1_0_132\win32\x86\usr\bin\ntox86-ld: skipping incompatible ../lib\libminiupnpc.a when searching for -lminiupnpc
C:\bbndk\host_10_1_0_132\win32\x86\usr\bin\ntox86-ld: skipping incompatible ../lib/upnp\libminiupnpc.a when searching for -lminiupnpc
C:\bbndk\host_10_1_0_132\win32\x86\usr\bin\ntox86-ld: cannot find -lminiupnpc
cc: C:/bbndk/host_10_1_0_132/win32/x86/usr/bin/ntox86-ld caught signal 1
make[2]: Leaving directory `D:/Downloads/kuzarandasource/kuzaranda-src-01102013/x86'
make[2]: *** [o-g/fiume] Error 1
make[1]: Leaving directory `D:/Downloads/kuzarandasource/kuzaranda-src-01102013/x86'
make[1]: *** [debug] Error 2
make: *** [Simulator-Debug] Error 2

**** Build Finished ****

 

plz help..

Please use plain text.
BlackBerry Development Advisor
elena_laskavaia
Posts: 417
Registered: ‎10-27-2010
My Device: PlayBook

Re: make error -- how to debug??

Last post- You trying to link with arm libs on x86

Please use plain text.
Regular Contributor
ashish_developer
Posts: 96
Registered: ‎05-15-2013
My Device: blackberry z10
My Carrier: blackberry

Re: make error -- how to debug??

[ Edited ]

thanks for reply ,

then what should i do to resolve this error plz tell me...

 

thanks..

Please use plain text.