Welcome!

Welcome to the official BlackBerry Support Community Forums.

This is your resource to discuss support topics with your peers, and learn from each other.

inside custom component

Native Development

Reply
Developer
Posts: 238
Registered: ‎12-26-2010
My Device: BlackBerry Z10
My Carrier: Telus
Accepted Solution

"Make Error" while compiling

[ Edited ]

HI all, I've been trying to make this work the whole day but I couldnt find the source of the problem.

 

Any thoughts please???? What could cause this problem??

 

p.s.: the "censored" name is my project name

 

makeerror.PNG

www.jackdevora.com
Contributor
Posts: 34
Registered: ‎10-08-2012
My Device: developer
My Carrier: ??

Re: "Make Error" while compiling

could you give some more information on the problem?

because only knowing that it is a "make error" is not telling me much.

 

can you post the compiler output and maybe some sourcecode?

Developer
Posts: 238
Registered: ‎12-26-2010
My Device: BlackBerry Z10
My Carrier: Telus

Re: "Make Error" while compiling

Hi, thanks for the repl.

 

here's the output

 

**** Build of configuration Default for project FFMPEGTest ****

make Device-Debug 
sh mkpri.sh FFMPEGTest.pri
C:/bbndk/host_10_0_9_52/win32/x86/usr/bin/qmake -spec unsupported/blackberry-armv7le-g++ -o arm/Makefile FFMPEGTest.pro CONFIG+=device
C:/bbndk/host_10_0_9_52/win32/x86/usr/bin/qmake -spec unsupported/blackberry-x86-g++ -o x86/Makefile FFMPEGTest.pro CONFIG+=simulator
make -C ./arm -f Makefile debug
make[1]: Entering directory `I:/Works/NDK/FFMPEGTest/arm'
make -f Makefile.Debug
make[2]: Entering directory `I:/Works/NDK/FFMPEGTest/arm'
qcc -Vgcc_ntoarmv7le -lang-c++ -Wl,-rpath-link,C:/bbndk/target_10_0_9_386/qnx6/armle-v7/lib -Wl,-rpath-link,C:/bbndk/target_10_0_9_386/qnx6/armle-v7/usr/lib -o o.le-v7-g/FFMPEGTest o.le-v7-g/.obj/Capture.o o.le-v7-g/.obj/FFMPEGTest.o o.le-v7-g/.obj/ffbbdec.o o.le-v7-g/.obj/ffbbenc.o o.le-v7-g/.obj/main.o o.le-v7-g/.obj/moc_FFMPEGTest.o    -LC:/bbndk/target_10_0_9_386/qnx6/armle-v7/lib -LC:/bbndk/target_10_0_9_386/qnx6/armle-v7/usr/lib -LC:/bbndk/target_10_0_9_386/qnx6/armle-v7/usr/lib/qt4/lib -LC:/bbndk/target_10_0_9_386/qnx6/usr/lib/qt4/lib -lm -lbps -lcamapi -lscreen -lbbsystem -L../ffmpeg/lib/gpl/ -lavformat -lavcodec -lavutil -L../libx264/lib/ -lx264 -lbb -lbbcascades -lQtDeclarative -lQtScript -lQtSvg -lQtSql -lQtXmlPatterns -lQtXml -lQtGui -lQtNetwork -lQtCore 
C:\bbndk\host_10_0_9_52\win32\x86\usr\bin\ntoarm-ld: cannot find -lavformat
make[2]: Leaving directory `I:/Works/NDK/FFMPEGTest/arm'
C:\bbndk\host_10_0_9_52\win32\x86\usr\bin\ntoarm-ld: cannot find -lavcodec
make[1]: Leaving directory `I:/Works/NDK/FFMPEGTest/arm'
C:\bbndk\host_10_0_9_52\win32\x86\usr\bin\ntoarm-ld: cannot find -lavutil
C:\bbndk\host_10_0_9_52\win32\x86\usr\bin\ntoarm-ld: cannot find -lx264
cc: C:/bbndk/host_10_0_9_52/win32/x86/usr/bin/ntoarm-ld caught signal 1
make[2]: *** [o.le-v7-g/FFMPEGTest] Error 1
make[1]: *** [debug] Error 2
make: *** [Device-Debug] Error 2

**** Build Finished ****

 

www.jackdevora.com
Developer
Posts: 238
Registered: ‎12-26-2010
My Device: BlackBerry Z10
My Carrier: Telus

Re: "Make Error" while compiling

[ Edited ]

Here is the output


 

**** Build of configuration Default for project FFMPEGTest ****

make Device-Debug 
sh mkpri.sh FFMPEGTest.pri
C:/bbndk/host_10_0_9_52/win32/x86/usr/bin/qmake -spec unsupported/blackberry-armv7le-g++ -o arm/Makefile FFMPEGTest.pro CONFIG+=device
C:/bbndk/host_10_0_9_52/win32/x86/usr/bin/qmake -spec unsupported/blackberry-x86-g++ -o x86/Makefile FFMPEGTest.pro CONFIG+=simulator
make -C ./arm -f Makefile debug
make[1]: Entering directory `I:/Works/NDK/FFMPEGTest/arm'
make -f Makefile.Debug
make[2]: Entering directory `I:/Works/NDK/FFMPEGTest/arm'
qcc -Vgcc_ntoarmv7le -lang-c++ -Wl,-rpath-link,C:/bbndk/target_10_0_9_386/qnx6/armle-v7/lib -Wl,-rpath-link,C:/bbndk/target_10_0_9_386/qnx6/armle-v7/usr/lib -o o.le-v7-g/FFMPEGTest o.le-v7-g/.obj/Capture.o o.le-v7-g/.obj/FFMPEGTest.o o.le-v7-g/.obj/ffbbdec.o o.le-v7-g/.obj/ffbbenc.o o.le-v7-g/.obj/main.o o.le-v7-g/.obj/moc_FFMPEGTest.o    -LC:/bbndk/target_10_0_9_386/qnx6/armle-v7/lib -LC:/bbndk/target_10_0_9_386/qnx6/armle-v7/usr/lib -LC:/bbndk/target_10_0_9_386/qnx6/armle-v7/usr/lib/qt4/lib -LC:/bbndk/target_10_0_9_386/qnx6/usr/lib/qt4/lib -lm -lbps -lcamapi -lscreen -lbbsystem -L../ffmpeg/lib/gpl/ -lavformat -lavcodec -lavutil -L../libx264/lib/ -lx264 -lbb -lbbcascades -lQtDeclarative -lQtScript -lQtSvg -lQtSql -lQtXmlPatterns -lQtXml -lQtGui -lQtNetwork -lQtCore 
C:\bbndk\host_10_0_9_52\win32\x86\usr\bin\ntoarm-ld: cannot find -lavformat
make[2]: Leaving directory `I:/Works/NDK/FFMPEGTest/arm'
C:\bbndk\host_10_0_9_52\win32\x86\usr\bin\ntoarm-ld: cannot find -lavcodec
make[1]: Leaving directory `I:/Works/NDK/FFMPEGTest/arm'
C:\bbndk\host_10_0_9_52\win32\x86\usr\bin\ntoarm-ld: cannot find -lavutil
C:\bbndk\host_10_0_9_52\win32\x86\usr\bin\ntoarm-ld: cannot find -lx264
cc: C:/bbndk/host_10_0_9_52/win32/x86/usr/bin/ntoarm-ld caught signal 1
make[2]: *** [o.le-v7-g/FFMPEGTest] Error 1
make[1]: *** [debug] Error 2
make: *** [Device-Debug] Error 2

**** Build Finished ****

 

www.jackdevora.com
New Developer
Posts: 88
Registered: ‎06-16-2012
My Device: N950/E7/N808/N9/X7/BB10 Alpha
My Carrier: Kievstar

Re: "Make Error" while compiling

you have to build ffmpeg for qnx, and then add -L<path-to-ffmpeg-libs> to makefile

Qt/Symbian/Meego/BB10/Cascades developer
Developer
Posts: 238
Registered: ‎12-26-2010
My Device: BlackBerry Z10
My Carrier: Telus

Re: "Make Error" while compiling

I copied the entire folder of FFMPEG and libfbb and libx264 from here

https://github.com/hardisonbrewing/libffbb

 

And I added

INCLUDEPATH += ../ffmpeg/include ../libx264/include
LIBS +=  -L../ffmpeg/lib/gpl/$${ARCH} -lavformat -lavcodec -lavutil -L../libx264/lib/$${ARCH} -lx264

Just like the FFCameraSample PRO file..

 

The FFCameraSample compiles fine, while mine generates those error..

 

What am I missing here?? Thanks and sorryyy

www.jackdevora.com
Developer
Posts: 1,041
Registered: ‎07-16-2008
My Device: ಠ_ಠ

Re: "Make Error" while compiling

You don't have ARCH set, so its not using the correct lib folder.

Highlighted
Developer
Posts: 238
Registered: ‎12-26-2010
My Device: BlackBerry Z10
My Carrier: Telus

Re: "Make Error" while compiling

Ahaa!!! Thank you!

www.jackdevora.com
Regular Contributor
Posts: 96
Registered: ‎05-15-2013
My Device: blackberry z10
My Carrier: blackberry

Re: "Make Error" while compiling

hi,

i have the same problem...here is my console output

 

*** Build of configuration Simulator-Debug for project fiume ****

make Simulator-Debug
make -C .//translations -f Makefile update
make[1]: Entering directory `D:/Downloads/kuzarandasource/kuzaranda-src-01102013/translations'
C:/bbndk/host_10_1_0_132/win32/x86/usr/bin/lupdate fiume.pro
Updating 'fiume.ts'...
Found 35 source text(s) (0 new and 35 already existing)
make[1]: Leaving directory `D:/Downloads/kuzarandasource/kuzaranda-src-01102013/translations'
make -C .//translations -f Makefile release
cd x86 && C:/bbndk/host_10_1_0_132/win32/x86/usr/bin/qmake -spec blackberry-x86-qcc ../fiume.pro CONFIG+=debug_and_release CONFIG+=simulator
make[1]: Entering directory `D:/Downloads/kuzarandasource/kuzaranda-src-01102013/translations'
C:/bbndk/host_10_1_0_132/win32/x86/usr/bin/lrelease fiume.pro
Updating 'D:/Downloads/kuzarandasource/kuzaranda-src-01102013/translations/fiume.qm'...
Generated 0 translation(s) (0 finished and 0 unfinished)
Ignored 35 untranslated source text(s)
make[1]: Leaving directory `D:/Downloads/kuzarandasource/kuzaranda-src-01102013/translations'
make -C ./x86 -f Makefile debug
make[1]: Entering directory `D:/Downloads/kuzarandasource/kuzaranda-src-01102013/x86'
make -f Makefile.Debug
make[2]: Entering directory `D:/Downloads/kuzarandasource/kuzaranda-src-01102013/x86'
qcc -Vgcc_ntox86 -lang-c++ -Wl,-rpath-link,C:/bbndk/target_10_1_0_1020/qnx6/x86/lib -Wl,-rpath-link,C:/bbndk/target_10_1_0_1020/qnx6/x86/usr/lib -Wl,-rpath-link,C:/bbndk/target_10_1_0_1020/qnx6/x86/usr/lib/qt4/lib -o o-g/fiume o-g/.obj/AddressBook.o o-g/.obj/AudioManager.o o-g/.obj/BpsPlatform.o o-g/.obj/ContactEditor.o o-g/.obj/ContactViewer.o o-g/.obj/Fiume.o o-g/.obj/PjCallback.o o-g/.obj/buddy.o o-g/.obj/callhistory.o o-g/.obj/callhistoryrecord.o o-g/.obj/debugger.o o-g/.obj/kuzaranda.o o-g/.obj/main.o o-g/.obj/navigator.o o-g/.obj/moc_AddressBook.o o-g/.obj/moc_AudioManager.o o-g/.obj/moc_BpsPlatform.o o-g/.obj/moc_ContactEditor.o o-g/.obj/moc_ContactViewer.o o-g/.obj/moc_Fiume.o o-g/.obj/moc_PjCallback.o o-g/.obj/moc_buddy.o o-g/.obj/moc_callhistory.o o-g/.obj/moc_callhistoryrecord.o o-g/.obj/moc_debugger.o o-g/.obj/moc_kuzaranda.o o-g/.obj/moc_navigator.o -LC:/bbndk/target_10_1_0_1020/qnx6/x86/lib -LC:/bbndk/target_10_1_0_1020/qnx6/x86/usr/lib -LC:/bbndk/target_10_1_0_1020/qnx6/x86/usr/lib/qt4/lib -LC:/bbndk/target_10_1_0_1020/qnx6//usr/lib/qt4/lib -L../lib -L../lib/upnp -lpjsua-arm-unknown-nto-qnx8.0.0eabi -lpjsip-ua-arm-unknown-nto-qnx8.0.0eabi -lpjsip-simple-arm-unknown-nto-qnx8.0.0eabi -lpjsip-arm-unknown-nto-qnx8.0.0eabi -lpjmedia-codec-arm-unknown-nto-qnx8.0.0eabi -lpjmedia-videodev-arm-unknown-nto-qnx8.0.0eabi -lpjmedia-arm-unknown-nto-qnx8.0.0eabi -lpjmedia-audiodev-arm-unknown-nto-qnx8.0.0eabi -lpjnath-arm-unknown-nto-qnx8.0.0eabi -lpjlib-util-arm-unknown-nto-qnx8.0.0eabi -lresample-arm-unknown-nto-qnx8.0.0eabi -lmilenage-arm-unknown-nto-qnx8.0.0eabi -lsrtp-arm-unknown-nto-qnx8.0.0eabi -lgsmcodec-arm-unknown-nto-qnx8.0.0eabi -lspeex-arm-unknown-nto-qnx8.0.0eabi -lilbccodec-arm-unknown-nto-qnx8.0.0eabi -lg7221codec-arm-unknown-nto-qnx8.0.0eabi -lportaudio-arm-unknown-nto-qnx8.0.0eabi -lpj-arm-unknown-nto-qnx8.0.0eabi -lasound -lcrypto -lssl -lbbpim -laudio_manager -lbb -lbbsystem -lbbplatform -lscreen -lminiupnpc -LC:/bbndk/target_10_1_0_1020/qnx6/usr/share/qt4/lib -lQtSensors -lbbcascades -lQtDeclarative -lQtScript -lQtSvg -lQtSql -lsqlite3 -lz -lQtXmlPatterns -lQtGui -lQtNetwork -lsocket -lQtCore -lm -lbps
Could not find qmake configuration fileUsing OS scope before setting MAKEFILE_GENERATORC:/bbndk/target_10_1_0_1020/qnx6/usr/share/qt4/mkspecs/features/mobility.prf(29): Using OS scope before setting MAKEFILE_GENERATORC:/bbndk/target_10_1_0_1020/qnx6/usr/share/qt4/mkspecs/features/mobility.prf(41): Using OS scope before setting MAKEFILE_GENERATORC:/bbndk/target_10_1_0_1020/qnx6/usr/share/qt4/mkspecs/features/mobility.prf(23): 'qtAddLibrary' is not a recognized test functionC:/bbndk/target_10_1_0_1020/qnx6/usr/share/qt4/mkspecs/features/mobility.prf(133): Using OS scope before setting MAKEFILE_GENERATORC:/bbndk/target_10_1_0_1020/qnx6/usr/share/qt4/mkspecs/features/qt.prf(4): Using OS scope before setting MAKEFILE_GENERATORC:/bbndk/target_10_1_0_1020/qnx6/usr/share/qt4/mkspecs/features/qt.prf(36): Using OS scope before setting MAKEFILE_GENERATORC:/bbndk/target_10_1_0_1020/qnx6/usr/share/qt4/mkspecs/features/qt.prf(197): 'qtAddLibrary' is not a recognized test functionC:/bbndk/target_10_1_0_1020/qnx6/usr/share/qt4/mkspecs/features/qt.prf(213): Using OS scope before setting MAKEFILE_GENERATORC:/bbndk/target_10_1_0_1020/qnx6/usr/share/qt4/mkspecs/features/moc.prf(3): 'qtPrepareTool' is not a recognized test functionC:/bbndk/target_10_1_0_1020/qnx6/usr/share/qt4/mkspecs/features/moc.prf(12): Using OS scope before setting MAKEFILE_GENERATORC:/bbndk/target_10_1_0_1020/qnx6/usr/share/qt4/mkspecs/features/moc.prf(97): Using OS scope before setting MAKEFILE_GENERATORC:/bbndk/target_10_1_0_1020/qnx6/usr/share/qt4/mkspecs/features/uic.prf(108): Using OS scope before setting MAKEFILE_GENERATORCould not find qmake configuration fileUsing OS scope before setting MAKEFILE_GENERATORC:/bbndk/target_10_1_0_1020/qnx6/usr/share/qt4/mkspecs/features/mobility.prf(29): Using OS scope before setting MAKEFILE_GENERATORC:/bbndk/target_10_1_0_1020/qnx6/usr/share/qt4/mkspecs/features/mobility.prf(41): Using OS scope before setting MAKEFILE_GENERATORC:/bbndk/target_10_1_0_1020/qnx6/usr/share/qt4/mkspecs/features/mobility.prf(23): 'qtAddLibrary' is not a recognized test functionC:/bbndk/target_10_1_0_1020/qnx6/usr/share/qt4/mkspecs/features/mobility.prf(133): Using OS scope before setting MAKEFILE_GENERATORC:/bbndk/target_10_1_0_1020/qnx6/usr/share/qt4/mkspecs/features/qt.prf(4): Using OS scope before setting MAKEFILE_GENERATORC:/bbndk/target_10_1_0_1020/qnx6/usr/share/qt4/mkspecs/features/qt.prf(36): Using OS scope before setting MAKEFILE_GENERATORC:/bbndk/target_10_1_0_1020/qnx6/usr/share/qt4/mkspecs/features/qt.prf(197): 'qtAddLibrary' is not a recognized test functionC:/bbndk/target_10_1_0_1020/qnx6/usr/share/qt4/mkspecs/features/qt.prf(213): Using OS scope before setting MAKEFILE_GENERATORC:/bbndk/target_10_1_0_1020/qnx6/usr/share/qt4/mkspecs/features/moc.prf(3): 'qtPrepareTool' is not a recognized test functionC:/bbndk/target_10_1_0_1020/qnx6/usr/share/qt4/mkspecs/features/moc.prf(12): Using OS scope before setting MAKEFILE_GENERATORC:/bbndk/target_10_1_0_1020/qnx6/usr/share/qt4/mkspecs/features/moc.prf(97): Using OS scope before setting MAKEFILE_GENERATORC:/bbndk/target_10_1_0_1020/qnx6/usr/share/qt4/mkspecs/features/uic.prf(108): Using OS scope before setting MAKEFILE_GENERATORC:\bbndk\host_10_1_0_132\win32\x86\usr\bin\ntox86-ld: skipping incompatible ../lib\libpjsua-arm-unknown-nto-qnx8.0.0eabi.a when searching for -lpjsua-arm-unknown-nto-qnx8.0.0eabi
C:\bbndk\host_10_1_0_132\win32\x86\usr\bin\ntox86-ld: skipping incompatible ../lib/upnp\libpjsua-arm-unknown-nto-qnx8.0.0eabi.a when searching for -lpjsua-arm-unknown-nto-qnx8.0.0eabi
C:\bbndk\host_10_1_0_132\win32\x86\usr\bin\ntox86-ld: cannot find -lpjsua-arm-unknown-nto-qnx8.0.0eabi
C:\bbndk\host_10_1_0_132\win32\x86\usr\bin\ntox86-ld: skipping incompatible ../lib\libpjsip-ua-arm-unknown-nto-qnx8.0.0eabi.a when searching for -lpjsip-ua-arm-unknown-nto-qnx8.0.0eabi
C:\bbndk\host_10_1_0_132\win32\x86\usr\bin\ntox86-ld: skipping incompatible ../lib/upnp\libpjsip-ua-arm-unknown-nto-qnx8.0.0eabi.a when searching for -lpjsip-ua-arm-unknown-nto-qnx8.0.0eabi
C:\bbndk\host_10_1_0_132\win32\x86\usr\bin\ntox86-ld: cannot find -lpjsip-ua-arm-unknown-nto-qnx8.0.0eabi
C:\bbndk\host_10_1_0_132\win32\x86\usr\bin\ntox86-ld: skipping incompatible ../lib\libpjsip-simple-arm-unknown-nto-qnx8.0.0eabi.a when searching for -lpjsip-simple-arm-unknown-nto-qnx8.0.0eabi
C:\bbndk\host_10_1_0_132\win32\x86\usr\bin\ntox86-ld: skipping incompatible ../lib/upnp\libpjsip-simple-arm-unknown-nto-qnx8.0.0eabi.a when searching for -lpjsip-simple-arm-unknown-nto-qnx8.0.0eabi
C:\bbndk\host_10_1_0_132\win32\x86\usr\bin\ntox86-ld: cannot find -lpjsip-simple-arm-unknown-nto-qnx8.0.0eabi
C:\bbndk\host_10_1_0_132\win32\x86\usr\bin\ntox86-ld: skipping incompatible ../lib\libpjsip-arm-unknown-nto-qnx8.0.0eabi.a when searching for -lpjsip-arm-unknown-nto-qnx8.0.0eabi
C:\bbndk\host_10_1_0_132\win32\x86\usr\bin\ntox86-ld: skipping incompatible ../lib/upnp\libpjsip-arm-unknown-nto-qnx8.0.0eabi.a when searching for -lpjsip-arm-unknown-nto-qnx8.0.0eabi
C:\bbndk\host_10_1_0_132\win32\x86\usr\bin\ntox86-ld: cannot find -lpjsip-arm-unknown-nto-qnx8.0.0eabi
C:\bbndk\host_10_1_0_132\win32\x86\usr\bin\ntox86-ld: skipping incompatible ../lib\libpjmedia-codec-arm-unknown-nto-qnx8.0.0eabi.a when searching for -lpjmedia-codec-arm-unknown-nto-qnx8.0.0eabi
C:\bbndk\host_10_1_0_132\win32\x86\usr\bin\ntox86-ld: skipping incompatible ../lib/upnp\libpjmedia-codec-arm-unknown-nto-qnx8.0.0eabi.a when searching for -lpjmedia-codec-arm-unknown-nto-qnx8.0.0eabi
C:\bbndk\host_10_1_0_132\win32\x86\usr\bin\ntox86-ld: cannot find -lpjmedia-codec-arm-unknown-nto-qnx8.0.0eabi
C:\bbndk\host_10_1_0_132\win32\x86\usr\bin\ntox86-ld: skipping incompatible ../lib\libpjmedia-videodev-arm-unknown-nto-qnx8.0.0eabi.a when searching for -lpjmedia-videodev-arm-unknown-nto-qnx8.0.0eabi
C:\bbndk\host_10_1_0_132\win32\x86\usr\bin\ntox86-ld: skipping incompatible ../lib/upnp\libpjmedia-videodev-arm-unknown-nto-qnx8.0.0eabi.a when searching for -lpjmedia-videodev-arm-unknown-nto-qnx8.0.0eabi
C:\bbndk\host_10_1_0_132\win32\x86\usr\bin\ntox86-ld: cannot find -lpjmedia-videodev-arm-unknown-nto-qnx8.0.0eabi
C:\bbndk\host_10_1_0_132\win32\x86\usr\bin\ntox86-ld: skipping incompatible ../lib\libpjmedia-arm-unknown-nto-qnx8.0.0eabi.a when searching for -lpjmedia-arm-unknown-nto-qnx8.0.0eabi
C:\bbndk\host_10_1_0_132\win32\x86\usr\bin\ntox86-ld: skipping incompatible ../lib/upnp\libpjmedia-arm-unknown-nto-qnx8.0.0eabi.a when searching for -lpjmedia-arm-unknown-nto-qnx8.0.0eabi
C:\bbndk\host_10_1_0_132\win32\x86\usr\bin\ntox86-ld: cannot find -lpjmedia-arm-unknown-nto-qnx8.0.0eabi
C:\bbndk\host_10_1_0_132\win32\x86\usr\bin\ntox86-ld: skipping incompatible ../lib\libpjmedia-audiodev-arm-unknown-nto-qnx8.0.0eabi.a when searching for -lpjmedia-audiodev-arm-unknown-nto-qnx8.0.0eabi
C:\bbndk\host_10_1_0_132\win32\x86\usr\bin\ntox86-ld: skipping incompatible ../lib/upnp\libpjmedia-audiodev-arm-unknown-nto-qnx8.0.0eabi.a when searching for -lpjmedia-audiodev-arm-unknown-nto-qnx8.0.0eabi
C:\bbndk\host_10_1_0_132\win32\x86\usr\bin\ntox86-ld: cannot find -lpjmedia-audiodev-arm-unknown-nto-qnx8.0.0eabi
C:\bbndk\host_10_1_0_132\win32\x86\usr\bin\ntox86-ld: skipping incompatible ../lib\libpjnath-arm-unknown-nto-qnx8.0.0eabi.a when searching for -lpjnath-arm-unknown-nto-qnx8.0.0eabi
C:\bbndk\host_10_1_0_132\win32\x86\usr\bin\ntox86-ld: skipping incompatible ../lib/upnp\libpjnath-arm-unknown-nto-qnx8.0.0eabi.a when searching for -lpjnath-arm-unknown-nto-qnx8.0.0eabi
C:\bbndk\host_10_1_0_132\win32\x86\usr\bin\ntox86-ld: cannot find -lpjnath-arm-unknown-nto-qnx8.0.0eabi
C:\bbndk\host_10_1_0_132\win32\x86\usr\bin\ntox86-ld: skipping incompatible ../lib\libpjlib-util-arm-unknown-nto-qnx8.0.0eabi.a when searching for -lpjlib-util-arm-unknown-nto-qnx8.0.0eabi
C:\bbndk\host_10_1_0_132\win32\x86\usr\bin\ntox86-ld: skipping incompatible ../lib/upnp\libpjlib-util-arm-unknown-nto-qnx8.0.0eabi.a when searching for -lpjlib-util-arm-unknown-nto-qnx8.0.0eabi
C:\bbndk\host_10_1_0_132\win32\x86\usr\bin\ntox86-ld: cannot find -lpjlib-util-arm-unknown-nto-qnx8.0.0eabi
C:\bbndk\host_10_1_0_132\win32\x86\usr\bin\ntox86-ld: skipping incompatible ../lib\libresample-arm-unknown-nto-qnx8.0.0eabi.a when searching for -lresample-arm-unknown-nto-qnx8.0.0eabi
C:\bbndk\host_10_1_0_132\win32\x86\usr\bin\ntox86-ld: skipping incompatible ../lib/upnp\libresample-arm-unknown-nto-qnx8.0.0eabi.a when searching for -lresample-arm-unknown-nto-qnx8.0.0eabi
C:\bbndk\host_10_1_0_132\win32\x86\usr\bin\ntox86-ld: cannot find -lresample-arm-unknown-nto-qnx8.0.0eabi
C:\bbndk\host_10_1_0_132\win32\x86\usr\bin\ntox86-ld: skipping incompatible ../lib\libmilenage-arm-unknown-nto-qnx8.0.0eabi.a when searching for -lmilenage-arm-unknown-nto-qnx8.0.0eabi
C:\bbndk\host_10_1_0_132\win32\x86\usr\bin\ntox86-ld: skipping incompatible ../lib/upnp\libmilenage-arm-unknown-nto-qnx8.0.0eabi.a when searching for -lmilenage-arm-unknown-nto-qnx8.0.0eabi
C:\bbndk\host_10_1_0_132\win32\x86\usr\bin\ntox86-ld: cannot find -lmilenage-arm-unknown-nto-qnx8.0.0eabi
C:\bbndk\host_10_1_0_132\win32\x86\usr\bin\ntox86-ld: skipping incompatible ../lib\libsrtp-arm-unknown-nto-qnx8.0.0eabi.a when searching for -lsrtp-arm-unknown-nto-qnx8.0.0eabi
C:\bbndk\host_10_1_0_132\win32\x86\usr\bin\ntox86-ld: skipping incompatible ../lib/upnp\libsrtp-arm-unknown-nto-qnx8.0.0eabi.a when searching for -lsrtp-arm-unknown-nto-qnx8.0.0eabi
C:\bbndk\host_10_1_0_132\win32\x86\usr\bin\ntox86-ld: cannot find -lsrtp-arm-unknown-nto-qnx8.0.0eabi
C:\bbndk\host_10_1_0_132\win32\x86\usr\bin\ntox86-ld: skipping incompatible ../lib\libgsmcodec-arm-unknown-nto-qnx8.0.0eabi.a when searching for -lgsmcodec-arm-unknown-nto-qnx8.0.0eabi
C:\bbndk\host_10_1_0_132\win32\x86\usr\bin\ntox86-ld: skipping incompatible ../lib/upnp\libgsmcodec-arm-unknown-nto-qnx8.0.0eabi.a when searching for -lgsmcodec-arm-unknown-nto-qnx8.0.0eabi
C:\bbndk\host_10_1_0_132\win32\x86\usr\bin\ntox86-ld: cannot find -lgsmcodec-arm-unknown-nto-qnx8.0.0eabi
C:\bbndk\host_10_1_0_132\win32\x86\usr\bin\ntox86-ld: skipping incompatible ../lib\libspeex-arm-unknown-nto-qnx8.0.0eabi.a when searching for -lspeex-arm-unknown-nto-qnx8.0.0eabi
C:\bbndk\host_10_1_0_132\win32\x86\usr\bin\ntox86-ld: skipping incompatible ../lib/upnp\libspeex-arm-unknown-nto-qnx8.0.0eabi.a when searching for -lspeex-arm-unknown-nto-qnx8.0.0eabi
C:\bbndk\host_10_1_0_132\win32\x86\usr\bin\ntox86-ld: cannot find -lspeex-arm-unknown-nto-qnx8.0.0eabi
C:\bbndk\host_10_1_0_132\win32\x86\usr\bin\ntox86-ld: skipping incompatible ../lib\libilbccodec-arm-unknown-nto-qnx8.0.0eabi.a when searching for -lilbccodec-arm-unknown-nto-qnx8.0.0eabi
C:\bbndk\host_10_1_0_132\win32\x86\usr\bin\ntox86-ld: skipping incompatible ../lib/upnp\libilbccodec-arm-unknown-nto-qnx8.0.0eabi.a when searching for -lilbccodec-arm-unknown-nto-qnx8.0.0eabi
C:\bbndk\host_10_1_0_132\win32\x86\usr\bin\ntox86-ld: cannot find -lilbccodec-arm-unknown-nto-qnx8.0.0eabi
C:\bbndk\host_10_1_0_132\win32\x86\usr\bin\ntox86-ld: skipping incompatible ../lib\libg7221codec-arm-unknown-nto-qnx8.0.0eabi.a when searching for -lg7221codec-arm-unknown-nto-qnx8.0.0eabi
C:\bbndk\host_10_1_0_132\win32\x86\usr\bin\ntox86-ld: skipping incompatible ../lib/upnp\libg7221codec-arm-unknown-nto-qnx8.0.0eabi.a when searching for -lg7221codec-arm-unknown-nto-qnx8.0.0eabi
C:\bbndk\host_10_1_0_132\win32\x86\usr\bin\ntox86-ld: cannot find -lg7221codec-arm-unknown-nto-qnx8.0.0eabi
C:\bbndk\host_10_1_0_132\win32\x86\usr\bin\ntox86-ld: skipping incompatible ../lib\libportaudio-arm-unknown-nto-qnx8.0.0eabi.a when searching for -lportaudio-arm-unknown-nto-qnx8.0.0eabi
C:\bbndk\host_10_1_0_132\win32\x86\usr\bin\ntox86-ld: skipping incompatible ../lib/upnp\libportaudio-arm-unknown-nto-qnx8.0.0eabi.a when searching for -lportaudio-arm-unknown-nto-qnx8.0.0eabi
C:\bbndk\host_10_1_0_132\win32\x86\usr\bin\ntox86-ld: cannot find -lportaudio-arm-unknown-nto-qnx8.0.0eabi
C:\bbndk\host_10_1_0_132\win32\x86\usr\bin\ntox86-ld: skipping incompatible ../lib\libpj-arm-unknown-nto-qnx8.0.0eabi.a when searching for -lpj-arm-unknown-nto-qnx8.0.0eabi
C:\bbndk\host_10_1_0_132\win32\x86\usr\bin\ntox86-ld: skipping incompatible ../lib/upnp\libpj-arm-unknown-nto-qnx8.0.0eabi.a when searching for -lpj-arm-unknown-nto-qnx8.0.0eabi
C:\bbndk\host_10_1_0_132\win32\x86\usr\bin\ntox86-ld: cannot find -lpj-arm-unknown-nto-qnx8.0.0eabi
C:\bbndk\host_10_1_0_132\win32\x86\usr\bin\ntox86-ld: skipping incompatible ../lib\libminiupnpc.a when searching for -lminiupnpc
C:\bbndk\host_10_1_0_132\win32\x86\usr\bin\ntox86-ld: skipping incompatible ../lib/upnp\libminiupnpc.a when searching for -lminiupnpc
C:\bbndk\host_10_1_0_132\win32\x86\usr\bin\ntox86-ld: cannot find -lminiupnpc
cc: C:/bbndk/host_10_1_0_132/win32/x86/usr/bin/ntox86-ld caught signal 1
make[2]: Leaving directory `D:/Downloads/kuzarandasource/kuzaranda-src-01102013/x86'
make[2]: *** [o-g/fiume] Error 1
make[1]: Leaving directory `D:/Downloads/kuzarandasource/kuzaranda-src-01102013/x86'
make[1]: *** [debug] Error 2
make: *** [Simulator-Debug] Error 2

**** Build Finished ****

 

plz help..